Vrije tijd en cultuur
narrower: Historische bibliotheek (archieven)
type: Concept

Historische bibliotheek (archieven)
type: Concept
type: CBS begrip
in scheme: Begrippen CBS
preferred label: Historical library (archives) @en
definition: Verzameling boeken, tijdschriften en dergelijke die veelal resultaten bevatten van historisch onderzoek op basis van (het eigen) archiefmateriaal.
definition: Collection of books, periodicals etc. containing mostly results of historical research based on archives. @en
version info: 1
broader: Vrije tijd en cultuur
source: historische-bibliotheek--archieven--
modified: 2022-02-23T15:53:48Z
created: 2016-03-23T09:11:35Z

CBS begrip
label: CBS concept @en

Begrippen CBS
type: ConceptScheme
preferred label: Concepts Statistics Netherlands @en