Arbeid en sociale zekerheid
narrower: Contractuele loonkosten
type: Concept

Contractuele loonkosten
type: Concept
type: CBS begrip
in scheme: Begrippen CBS
preferred label: Contractual wage costs @en
definition: Het CAO-loon inclusief bijzondere beloningen, vermeerderd met de wettelijke en contractuele werkgeverspremies voor pensioen, vut, werkloosheid, ziektekosten, arbeidsongeschiktheid en sociale fondsen.
definition: The collective labour agreement wage rate including special payments plus the legally and contractually required employee contributions for pensions, early retirement, unemployment, labour disability and social funds. @en
version info: 1
broader: Arbeid en sociale zekerheid
source: contractuele-loonkosten
modified: 2022-02-23T15:53:07Z
created: 2016-03-23T09:08:11Z

CBS begrip
label: CBS concept @en

Begrippen CBS
type: ConceptScheme
preferred label: Concepts Statistics Netherlands @en