Veiligheid en recht
narrower: Celbestemming
type: Concept

Voorlopige hechtenis
related: Celbestemming
type: Concept
type: CBS begrip
preferred label: Detention on remand @en

Huis van bewaring
related: Celbestemming
type: Concept
type: CBS begrip
preferred label: Detention centre @en

Gecombineerde penitentiaire inrichting
related: Celbestemming
type: Concept
type: CBS begrip

Gedetineerde
related: Celbestemming
type: Concept
type: CBS begrip
preferred label: Detainee @en

Gevangenis
related: Celbestemming
type: Concept
type: CBS begrip
preferred label: Prison @en

Celbestemming
type: Concept
type: CBS begrip
in scheme: Begrippen CBS
preferred label: Use of cells @en
definition: Soort insluiting waarvoor een cel in een penitentiaire inrichting kan worden gebruikt.
definition: Typology of penitentiary institutions by type of detainees in the institution. The classification is based on the Penitentiaire Beginselenwet 1998. @en
version info: 1
broader: Veiligheid en recht
scope note: De volgende celbestemmingen worden onderscheiden: - huis van bewaring, - gevangenis, - inrichting voor stelselmatige daders, - overige capaciteit. Bij elk van deze bestemmingen worden plaatsen aangewezen die uitsluitend bestemd zijn voor vrouwen. Vaststelling van de bestemming wordt geregeld in Penitentiaire Beginselenwet 1998. Bijvoorbeeld een gedetineerde die nog niet onherroepelijk door de rechter veroordeeld is en in voorlopige hechtenis zit, gebruikt een plaats met de celbestemming "huis van bewaring".
source: celbestemming
modified: 2022-02-23T15:53:02Z
created: 2016-03-23T09:08:19Z
related: Voorlopige hechtenis
related: Huis van bewaring
related: Gecombineerde penitentiaire inrichting
related: Gedetineerde
related: Gevangenis

CBS begrip
label: CBS concept @en

Begrippen CBS
type: ConceptScheme
preferred label: Concepts Statistics Netherlands @en