Arbeid en sociale zekerheid
narrower: Brutoloon sociale verzekeringen
type: Concept

Brutoloon sociale verzekeringen
type: Concept
type: CBS begrip
in scheme: Begrippen CBS
preferred label: Gross wage applicable for social insurance schemes @en
alternative label: Blsv
definition: Het loon waarover de premies voor werknemersverzekeringen, zoals de Werkloosheidswet (WW) en Ziekenfondswet (ZFW), worden berekend.
definition: The wage on which employees have to pay social security contributions such as unemployment (WW) and health insurance (ZW). @en
version info: 1
broader: Arbeid en sociale zekerheid
scope note: Het gaat hierbij om loon uit tegenwoordige dienstbetrekking dat door de werkgever aan de werknemer wordt betaald. Tot het blsv worden naast loon in geld ook fooien en niet in geld uitgekeerd loon (loon in natura, zoals verstrekking van kleding, gebruik woning, opties en kinderopvang) gerekend. De bijdragen van werknemers voor pensioen- en VUT-regelingen alsmede beloningscomponenten die uitsluitend bij de bepaling van de loonbelasting/premies volksverzekeringen een rol spelen (o.a. werkgeversdeel ZFW) behoren niet tot het blsv.
source: brutoloon-sociale-verzekeringen--blsv--
modified: 2022-02-23T15:52:56Z
created: 2016-03-23T09:04:01Z

CBS begrip
label: CBS concept @en

Begrippen CBS
type: ConceptScheme
preferred label: Concepts Statistics Netherlands @en