Industrie en energie
narrower: Jaargang kapitaalgoed
type: Concept

Jaargang kapitaalgoed
type: Concept
type: CBS begrip
in scheme: Begrippen CBS
preferred label: Vintage of capital goods @en
definition: The year in which the capital goods become available for the production process for the first time. @en
definition: Het jaar waarin een kapitaalgoed voor het eerst ter beschikking van het productieproces staat.
version info: 1
broader: Industrie en energie
source: jaargang-kapitaalgoed
modified: 2022-02-23T15:54:03Z
created: 2016-03-23T09:08:59Z

CBS begrip
label: CBS concept @en

Begrippen CBS
type: ConceptScheme
preferred label: Concepts Statistics Netherlands @en