Zorg en gezondheid
narrower: Algemeen maatschappelijk werk
type: Concept

Algemeen maatschappelijk werk
type: Concept
type: CBS begrip
in scheme: Begrippen CBS
preferred label: Social work @en
alternative label: AMW
definition: Ambulante, concrete dienstverlening, advisering, bemiddeling en psychosociale hulpverlening aan personen die kampen met problemen van maatschappelijke en/of individuele aard. Daarnaast vindt signalering en preventie plaats.
definition: Hands-on help, advice, mediation and psychological and social aid to people with social or personal difficulties. Prevention and indication of problems are also included. @en
version info: 1
broader: Zorg en gezondheid
scope note: Het begrip "algemeen" betekent in deze context: laagdrempelig, toegankelijk zonder verwijzing en niet specifiek/exclusief gericht op bepaalde groepen in de samenleving of op specifieke problemen.
source: algemeen-maatschappelijk-werk--amw--
modified: 2022-02-23T15:52:20Z
created: 2016-03-23T09:03:34Z

CBS begrip
label: CBS concept @en

Begrippen CBS
type: ConceptScheme
preferred label: Concepts Statistics Netherlands @en