Arbeid en sociale zekerheid
narrower: Toeslagenwet
type: Concept

Toeslagenwet
type: Concept
type: CBS begrip
in scheme: Begrippen CBS
preferred label: Supplementary Benefits Act (TW) @en
definition: Wet die voorziet in het verlenen van een toeslag tot het relevante sociale minimum aan uitkeringsgerechtigden op grond van verschillende sociale zekerheidsuitkeringen.
definition: The Supplementary Benefits Act tops up benefits under ZW, WW, WAZ, and Wajong provisions (for sickness and disability) to the guaranteed income level. The law came into force on 1 January 1987 and replaces the provisions for minimum protection specified @en
version info: 1
broader: Arbeid en sociale zekerheid
scope note: Dit zijn oa. de Ziektewet, de Werkloosheidswet, de Algemene Arbeidsongeschiktheidswet, de Wet op de arbeidsongeschiktheidsverzekering en de Wet arbeidsongeschiktheidsvoorziening militairen. De wet is in werking getreden op 1 januari 1987 en vervangt de tot die datum in de genoemde wetten zelf opgenomen regels met betrekking tot de minimumbescherming.
source: toeslagenwet
modified: 2022-02-23T15:55:47Z
created: 2016-03-23T09:05:48Z

CBS begrip
label: CBS concept @en

Begrippen CBS
type: ConceptScheme
preferred label: Concepts Statistics Netherlands @en