Arbeid en sociale zekerheid
narrower: CAO-sector gesubsidieerde instellingen
type: Concept

CAO-sector
related: CAO-sector gesubsidieerde instellingen
type: Concept
type: CBS begrip
preferred label: Collective labour agreement sector (CAO sector) @en

Gepremieerde en gesubsidieerde sector
related: CAO-sector gesubsidieerde instellingen
type: Concept
type: CBS begrip
preferred label: Subsidised sector @en

CAO-sector gesubsidieerde instellingen
type: Concept
type: CBS begrip
in scheme: Begrippen CBS
preferred label: Collective labour agreement sector subsidised corporations @en
definition: De CAO-sector bestaande uit privaatrechtelijke bedrijven die door subsidie of via wettelijk vastgestelde bijdragen worden gefinancierd, voor zover zij niet tot de overheid behoren. Het gaat hierbij onder meer om het grootste deel van de gezondheids- en welzijnszorg, de uitvoeringsorganen voor de sociale verzekeringen en de sociale werkplaatsen.
definition: The collective labour agreement (CAO in Dutch) sector of private companies financed through subsidies or amounts set by law in as far as they are not part of the government. Mostly they are active in health and care, administrators of social security and @en
version info: 1
broader: Arbeid en sociale zekerheid
source: cao-sector-gesubsidieerde-instellingen
modified: 2022-02-23T15:53:00Z
created: 2016-03-23T09:04:26Z
related: CAO-sector
related: Gepremieerde en gesubsidieerde sector

CBS begrip
label: CBS concept @en

Begrippen CBS
type: ConceptScheme
preferred label: Concepts Statistics Netherlands @en