Natuur en milieu
narrower: Spoorterrein
type: Concept

Classificatie Bodemgebruik
related: Spoorterrein
type: Concept
type: CBS begrip
preferred label: Land use, classification @en

Spoorterrein
type: Concept
type: CBS begrip
in scheme: Begrippen CBS
preferred label: Railway area @en
definition: Terrein in gebruik voor verkeer en vervoer per rail.
definition: Area used for traffic and transport by rail. @en
version info: 1
broader: Natuur en milieu
scope note: Stations en bijbehorende parkeerplaatsen worden ook tot spoorterrein gerekend. Smalspoor wordt niet tot spoorterrein gerekend maar tot de aangrenzende vorm van bodemgebruik.
source: spoorterrein
modified: 2022-02-23T15:55:31Z
created: 2016-03-23T09:07:30Z
related: Classificatie Bodemgebruik

CBS begrip
label: CBS concept @en

Begrippen CBS
type: ConceptScheme
preferred label: Concepts Statistics Netherlands @en