Bevolking
narrower: Overig meerpersoonshuishouden met kinderen
type: Concept

Samenstelling huishouden
related: Overig meerpersoonshuishouden met kinderen
type: Concept
type: CBS begrip
preferred label: Household composition @en

Overig meerpersoonshuishouden met kinderen
type: Concept
type: CBS begrip
in scheme: Begrippen CBS
preferred label: Other multi-person household with children @en
definition: Particulier huishouden bestaande uit een eenoudergezin of paar met uitsluitend meerderjarige thuiswonende kinderen, of uit een eenoudergezin of paar met minderjarige thuiswonende kinderen en met overige leden van het huishouden.
definition: Private household consisting of a single parent family or couple with adult children living at home, or a single parent family or couple with under age children living at home and other household members. @en
version info: 1
broader: Bevolking
source: overig-meerpersoonshuishouden-met-kinderen
modified: 2022-02-23T15:54:50Z
created: 2016-03-23T09:12:46Z
related: Samenstelling huishouden

CBS begrip
label: CBS concept @en

Begrippen CBS
type: ConceptScheme
preferred label: Concepts Statistics Netherlands @en