Macro-economie
narrower: Structuureffect
type: Concept

Structuureffect
type: Concept
type: CBS begrip
in scheme: Begrippen CBS
definition: Het verschil tussen de ontwikkeling van de loonkosten per gewerkt uur en de prijs van arbeid.
version info: 1
broader: Macro-economie
created: 2023-03-29T09:17:24

CBS begrip
label: CBS concept @en

Begrippen CBS
type: ConceptScheme
preferred label: Concepts Statistics Netherlands @en