Verkeer en vervoer
narrower: Kilometers door Nederlandse voertuigen
type: Concept

Kilometers door Nederlandse voertuigen
type: Concept
type: CBS begrip
in scheme: Begrippen CBS
preferred label: Kilometres by Dutch vehicles @en
definition: De totaal afgelegde afstand (in km) in Nederland en in het buitenland door voertuigen met een Nederlands kenteken.
definition: The total distance travelled (in km) in the Netherlands and abroad by vehicles with a Dutch registration plate. @en
version info: 1
broader: Verkeer en vervoer
source: kilometers-door-nederlandse-voertuigen
modified: 2022-02-23T15:54:07Z
created: 2016-03-23T09:19:44Z

CBS begrip
label: CBS concept @en

Begrippen CBS
type: ConceptScheme
preferred label: Concepts Statistics Netherlands @en