Veiligheid en recht
narrower: Dagvaardingsformulier
type: Concept

Dagvaardingsformulier
type: Concept
type: CBS begrip
in scheme: Begrippen CBS
definition: Formulier om een procedure bij de kantonrechter te beginnen. Rechtzoekenden konden dit formulier zelf invullen. Deze voorziening is in 1991 ingevoerd om de toegang tot de rechter te vereenvoudigen en is per 1 januari 2002 afgeschaft.
version info: 1
broader: Veiligheid en recht
source: dagvaardingsformulier
modified: 2022-02-23T15:53:11Z
created: 2016-03-23T09:14:46Z

CBS begrip
label: CBS concept @en

Begrippen CBS
type: ConceptScheme
preferred label: Concepts Statistics Netherlands @en