Zorg en gezondheid
narrower: Primaire doodsoorzaak
type: Concept

Secundaire doodsoorzaak
related: Primaire doodsoorzaak
type: Concept
type: CBS begrip

Primaire doodsoorzaak
type: Concept
type: CBS begrip
in scheme: Begrippen CBS
preferred label: Primary cause of death @en
alternative label: Doodsoorzaak
definition: De ziekte of de gebeurtenis waarmee de aaneenschakeling van gebeurtenissen die tot de dood leidde, startte. Men spreekt hierbij wel van de onderliggende ziekte of het grondlijden.
definition: The illness, situation or event that started the chain of events that led to death. @en
version info: 1
broader: Zorg en gezondheid
scope note: Gevolgen of complicaties hiervan worden meestal als secundaire doodsoorzaak beschouwd, evenals andere ziekten die ten tijde van het overlijden aanwezig waren en soms tot de dood hebben bijgedragen. Zie bij Methoden > Dataverzameling > Doodsoorzakenstatistiek voor meer informatie.
source: primaire-doodsoorzaak
modified: 2022-02-23T15:55:04Z
created: 2016-03-23T09:06:58Z
related: Secundaire doodsoorzaak

CBS begrip
label: CBS concept @en

Begrippen CBS
type: ConceptScheme
preferred label: Concepts Statistics Netherlands @en