Internationale handel
narrower: Invoerhoeveelheid
type: Concept

Invoer van goederen
related: Invoerhoeveelheid
type: Concept
type: CBS begrip
preferred label: Import of goods @en

Invoerhoeveelheid
type: Concept
type: CBS begrip
in scheme: Begrippen CBS
preferred label: Import quantity @en
definition: De hoeveelheid van de goederen die vanuit het buitenland naar Nederland komen volgens de methode van fysieke grensoverschrijding.
definition: The quantity of goods that come to the Netherlands from abroad according to the method of physical border crossing. @en
version info: 1
broader: Internationale handel
scope note: Per goederensoort worden de hoeveelheden uitgedrukt in afgesproken eenheden op basis van de Gecombineerde Nomenclatuur (GN). Meestal is de eenheid ‘kilogram', maar er worden ook andere eenheden gebruikt zoals ‘stuks’ en ‘liter’.
source: invoerhoeveelheid
created: 2023-01-16T16:22:12Z
subject: https://taxonomie.cbs.nl/vocab/id/1991
related: Invoer van goederen

CBS begrip
label: CBS concept @en

Begrippen CBS
type: ConceptScheme
preferred label: Concepts Statistics Netherlands @en