Diensten
narrower: Institutionele belegger
type: Concept

Institutionele belegger
type: Concept
type: CBS begrip
in scheme: Begrippen CBS
preferred label: Institutional investor @en
definition: Instelling die gelden ter beschikking krijgt die moeten worden belegd, te weten een verzekeringsinstelling, pensioenfonds of beleggingsinstelling.
definition: An institution with money at its disposal for investment, such as an insurance company, pension fund or investment company. @en
version info: 1
broader: Diensten
scope note: Beleggingsfondsen die voornamelijk beleggen in geldmarktinstrumenten ( de zogenaamde Geldmarktfondsen) worden niet tot de institutionele beleggers gerekend.
source: institutionele-belegger
modified: 2022-02-23T15:53:59Z
created: 2016-03-23T09:07:08Z

CBS begrip
label: CBS concept @en

Begrippen CBS
type: ConceptScheme
preferred label: Concepts Statistics Netherlands @en