Industrie en energie
narrower: Centrale productie van elektriciteit
type: Concept

Centrale productie van elektriciteit
type: Concept
type: CBS begrip
in scheme: Begrippen CBS
preferred label: Central production of electricity @en
definition: De productie van elektriciteit door thermische of nucleaire centrales die regulier leveren aan het landelijke hoogspanningsnet van Tennet.
definition: The centrally co-ordinated generation of electricity by units linked to the high tension network of TENNET. @en
version info: 1
broader: Industrie en energie
scope note: Dit worden ook wel de elektriciteitscentrales genoemd. In Nederland bestaat het hoogspanningsnet uit de netten met een spanning van 110 kV en hoger.
source: centrale-productie-van-elektriciteit
modified: 2022-02-23T15:53:02Z
created: 2016-03-23T09:09:38Z

CBS begrip
label: CBS concept @en

Begrippen CBS
type: ConceptScheme
preferred label: Concepts Statistics Netherlands @en