Arbeid en sociale zekerheid
narrower: Loonheffing
type: Concept

Loonheffing
type: Concept
type: CBS begrip
in scheme: Begrippen CBS
preferred label: Levy on wages, allowances and pensions @en
definition: De inkomstenbelasting en de premies voor de volksverzekeringen.
definition: Income tax plus premiums for compulsory national insurances. @en
version info: 1
broader: Arbeid en sociale zekerheid
scope note: De volksverzekeringen betreffen: - algemene kinderbijslagwet (AKW, tot 1.1.1989); - algemene arbeidsongeschiktheidswet (AAW, tot 1.7.1998); - algemene ouderdomswet (AOW) - algemene weduwen en wezenwet (AWW, tot 1.7.1996) - algemene nieuwe nabestaandenwet (Anw); - algemene wet bijzondere ziektekosten (AWBZ).
source: loonheffing
modified: 2022-02-23T15:54:17Z
created: 2016-03-23T09:04:52Z

CBS begrip
label: CBS concept @en

Begrippen CBS
type: ConceptScheme
preferred label: Concepts Statistics Netherlands @en