Verkeer en vervoer
narrower: Brutogewicht van goederen
type: Concept

Ladinggewicht
related: Brutogewicht van goederen
type: Concept
type: CBS begrip
preferred label: Cargo weight @en

Brutogewicht van goederen
type: Concept
type: CBS begrip
in scheme: Begrippen CBS
preferred label: Gross weight (goods transport) @en
definition: Het totale gewicht van de vervoerde goederen, alle verpakking, maar exclusief het leeggewicht van de transporteenheid
definition: The total weight of transported goods plus the weight of the packaging, but excluding the weight of the transport unit. @en
version info: 1
broader: Verkeer en vervoer
scope note: O.a. luchttransport)containers, wissellaadbakken en goederenpallets, alsook wegvoertuigen voor goederenvervoer, goederenwagens of binnenschepen die op of in het voertuig, vaartuig of luchtvaartuig vervoerd worden.
source: brutogewicht-van-goederen
modified: 2022-02-23T15:52:55Z
created: 2016-03-23T09:12:13Z
related: Ladinggewicht

CBS begrip
label: CBS concept @en

Begrippen CBS
type: ConceptScheme
preferred label: Concepts Statistics Netherlands @en