Geografie
narrower: Europese Unie: 6 landen (EU-6)
type: Concept

Europese Unie
related: Europese Unie: 6 landen (EU-6)
type: Concept
type: CBS begrip
preferred label: European Union @en

Europese Unie: 6 landen (EU-6)
type: Concept
type: CBS begrip
in scheme: Begrippen CBS
preferred label: EU-6 @en
definition: De samenstelling van de Europese Unie per 1 januari 1958: België, Bondsrepubliek Duitsland, Frankrijk, Italië, Luxemburg en Nederland.
definition: The composition of the European Union from 1 January 1958: Belgium, France, Germany (Federal Republic), Italy, Luxembourg, the Netherlands. @en
version info: 1
broader: Geografie
source: europese-unie-6-landen--eu-6--
modified: 2022-02-23T15:53:27Z
created: 2016-03-23T09:11:04Z
related: Europese Unie

CBS begrip
label: CBS concept @en

Begrippen CBS
type: ConceptScheme
preferred label: Concepts Statistics Netherlands @en