Arbeid en sociale zekerheid
narrower: Arbeidsverhouding
type: Concept

Arbeidsverhouding
type: Concept
type: CBS begrip
in scheme: Begrippen CBS
preferred label: Labour relations @en
definition: Het samenstel van materiële en immateriële arbeidsvoorwaarden en van arbeidsomstandigheden: aard van het werk, sociale zekerheid, status van het werk, gezagsverhoudingen, werkklimaat, informatie en communicatie.
definition: The system of material and immaterial terms of employment and working conditions: nature of the work, social security, status of the work, authority, working climate, information and communication. @en
version info: 1
broader: Arbeid en sociale zekerheid
source: arbeidsverhouding
modified: 2022-02-23T15:52:27Z
created: 2016-03-23T09:03:45Z

CBS begrip
label: CBS concept @en

Begrippen CBS
type: ConceptScheme
preferred label: Concepts Statistics Netherlands @en