Zorg en gezondheid
narrower: Ziekenhuistrombosedienst
type: Concept

Trombosedienst
related: Ziekenhuistrombosedienst
type: Concept
type: CBS begrip
preferred label: Care for thrombotic patients @en

Ziekenhuistrombosedienst
type: Concept
type: CBS begrip
in scheme: Begrippen CBS
preferred label: Hospital thrombosis service @en
definition: Een trombosedienst die onderdeel is van een ziekenhuis.
definition: A hospital thrombosis service has its thrombosis activities located in a hospital. @en
version info: 1
broader: Zorg en gezondheid
scope note: Tromboseactiviteiten zijn hier vaak op zodanige wijze in de totale ziekenhuisadministratie geïntegreerd dat uitsplitsing van de gegevens niet altijd mogelijk is.
source: ziekenhuistrombosedienst
modified: 2022-02-23T15:56:33Z
created: 2016-03-23T09:10:37Z
related: Trombosedienst

CBS begrip
label: CBS concept @en

Begrippen CBS
type: ConceptScheme
preferred label: Concepts Statistics Netherlands @en