Bevolking
narrower: Verblijfsvergunning voor bepaalde tijd
type: Concept

Verblijfsvergunning asiel
related: Verblijfsvergunning voor bepaalde tijd
type: Concept
type: CBS begrip

Verblijfsvergunning
related: Verblijfsvergunning voor bepaalde tijd
type: Concept
type: CBS begrip
preferred label: Residence permit @en

Verblijfsvergunning voor onbepaalde tijd
related: Verblijfsvergunning voor bepaalde tijd
type: Concept
type: CBS begrip
preferred label: Residence permit for an indefinite period @en

Reguliere verblijfsvergunning
related: Verblijfsvergunning voor bepaalde tijd
type: Concept
type: CBS begrip

Type verblijfsstatus niet-Nederlanders
related: Verblijfsvergunning voor bepaalde tijd
type: Concept
type: CBS begrip
preferred label: Type of residence status of non-Dutch people @en

Verblijfsvergunning voor bepaalde tijd
type: Concept
type: CBS begrip
in scheme: Begrippen CBS
preferred label: Residence permit for a definite period @en
definition: Document waaruit blijkt dat een niet-Nederlander toestemming heeft om gedurende een bepaalde termijn van langer dan drie maanden in Nederland te verblijven.
definition: Introduced on 1 April 2001 when the Immigration Law of 2000 came into force. The permit is valid for a maximum of five years. The permit indicates whether or not the holder has a work permit, and if so the employer must have an employment permit. @en
version info: 1
broader: Bevolking
scope note: Er is een vergunning voor bepaalde tijd regulier (vvr-bep) en een voor asiel (vva-bep). De asielvergunning wordt in beginsel voor een periode van 5 jaar verleend. De reguliere vergunning moet in beginsel jaarlijks worden verlengd.
source: verblijfsvergunning-voor-bepaalde-tijd
modified: 2022-02-23T15:55:59Z
created: 2016-03-23T09:10:44Z
related: Verblijfsvergunning asiel
related: Verblijfsvergunning
related: Verblijfsvergunning voor onbepaalde tijd
related: Reguliere verblijfsvergunning
related: Type verblijfsstatus niet-Nederlanders

CBS begrip
label: CBS concept @en

Begrippen CBS
type: ConceptScheme
preferred label: Concepts Statistics Netherlands @en