Diensten
narrower: Beleggingsinstelling
type: Concept

Beleggingsinstelling
type: Concept
type: CBS begrip
in scheme: Begrippen CBS
preferred label: Collective investment schemes @en
definition: Financiële instelling die middelen aantrekt bij een breed publiek door uitgifte van aandelen en andere deelhebbersbewijzen, waarbij aan deelname slechts formele, in principe door iedereen te vervullen, voorwaarden zijn verbonden.
definition: Financial institutions that request or acquire funds or other goods for collective investment in order to have the unit-holders share in the proceeds of the investments. @en
version info: 1
broader: Diensten
scope note: Betreft beleggingsinstellingen vallende onder de Wet toezicht beleggingsinstellingen (1990, Stb. 380) met uitzondering van de beleggingsinstellingen die geheel of vrijwel geheel in bezit zijn van verzekeraars.
source: beleggingsinstelling
modified: 2022-02-23T15:52:39Z
created: 2016-03-23T09:07:09Z

CBS begrip
label: CBS concept @en

Begrippen CBS
type: ConceptScheme
preferred label: Concepts Statistics Netherlands @en