Arbeid en sociale zekerheid
narrower: Wet inkomensvoorziening oudere en gedeeltelijk arbeidsongeschikte gewezen zelfstandigen
type: Concept

Wet inkomensvoorziening oudere en gedeeltelijk arbeidsongeschikte gewezen zelfstandigen
type: Concept
type: CBS begrip
in scheme: Begrippen CBS
preferred label: Act on Income Provisions for Older and Partially Disabled, Formerly Self-employed Persons (IOAZ) @en
alternative label: IOAZ
definition: De wet biedt een inkomensgarantie op het niveau van het sociaal minimum aan oudere en gedeeltelijk arbeidsongeschikte gewezen zelfstandigen, van wie het inkomen duurzaam minder bedraagt dan het sociaal minimum en die als gevolg daarvan het bedrijf of beroep hebben beëindigd. De wet is in werking getreden met ingang van 1 januari 1987 en is ingrijpend gewijzigd met ingang van 1 januari 1996.
definition: The law provides older and partially disabled persons who were formerly self-employed with a minimum guaranteed income, when their income is permanently below the social minimum and who have ended their company or profession because of it. The law came i @en
version info: 1
broader: Arbeid en sociale zekerheid
source: wet-inkomensvoorziening-oudere-en-gedeeltelijk-arbeidsongeschikte-gewezen-zelfstandigen--ioaz--
modified: 2022-02-23T15:56:26Z
created: 2016-03-23T09:06:17Z

CBS begrip
label: CBS concept @en

Begrippen CBS
type: ConceptScheme
preferred label: Concepts Statistics Netherlands @en