Onderwijs
narrower: Speciaal basisonderwijs (sbao)
type: Concept

Speciaal onderwijs (so)
related: Speciaal basisonderwijs (sbao)
type: Concept
type: CBS begrip
preferred label: Special education @en

Speciale scholen
related: Speciaal basisonderwijs (sbao)
type: Concept
type: CBS begrip
preferred label: Special schools @en

Speciaal basisonderwijs (sbao)
type: Concept
type: CBS begrip
in scheme: Begrippen CBS
preferred label: Special primary education @en
definition: De voortzetting van het voormalig basisonderwijs aan kinderen met leer- en opvoedingsmoeilijkheden (so-lom), moeilijk lerende kinderen (so-mlk) en in hun ontwikkeling bedreigde kleuters (iobk) voor zover verbonden aan scholen voor so-lom en so-mlk.
definition: The continuation of the previous school types for children with learning and behavioural difficulties (LOM) and children with learning difficulties (MLK), and for toddlers whose development requires special attention, in special primary education. @en
version info: 1
broader: Onderwijs
scope note: Tot 1998 was er de interimwet speciaal onderwijs en voortgezet speciaal onderwijs (ISOVSO) die al het onderwijs omvatte aan kinderen die, bijvoorbeeld als gevolg van een verstandelijke, lichamelijke of zintuiglijke handicap, meer hulp nodig hadden bij de opvoeding en het leren dan het regulier basis- of voortgezet onderwijs kon bieden. Het ging onder meer om: -kinderen met leer- en opvoedingsmoeilijkheden (lom); -moeilijk lerende kinderen (mlk); -in hun ontwikkeling bedreigde kleuters (iobk). Vanaf 1 augustus 1998 is de wetgeving op dit gebied veranderd en zijn de voormalige schoolsoorten so-lom, so-mlk en iobk (voor zover verbonden aan scholen voor so-lom en so-mlk) opgenomen in de Wet op het Basisonderwijs (WBO). Vanaf dat moment wordt het onderwijs aan deze drie groepen gegeven op scholen voor speciaal basisonderwijs. Tegelijkertijd is al het overige basisonderwijs dat onder de interimwet speciaal onderwijs en voortgezet speciaal onderwijs (ISOVSO) viel, ondergebracht in de Wet op de Expertisecentra (WEC). Zie ook: speciale scholen.
source: speciaal-basisonderwijs--sbao--
modified: 2022-02-23T15:55:30Z
created: 2016-03-23T09:08:07Z
related: Speciaal onderwijs (so)
related: Speciale scholen

CBS begrip
label: CBS concept @en

Begrippen CBS
type: ConceptScheme
preferred label: Concepts Statistics Netherlands @en