Macro-economie
narrower: Overige particuliere sociale premies
type: Concept

Overige particuliere sociale premies
type: Concept
type: CBS begrip
in scheme: Begrippen CBS
preferred label: Other private social contributions @en
definition: Premies afgedragen aan overige particuliere sociale verzekeringsinstellingen. De premies kunnen op dezelfde manier afgeleid worden als de pensioenpremies.
definition: These are contributions to private social schemes excluding pension schemes. The contributions to these schemes can be derived in the same way as the contributions to pension schemes. @en
version info: 1
broader: Macro-economie
source: overige-particuliere-sociale-premies
modified: 2022-02-23T15:54:52Z
created: 2016-03-23T09:10:25Z

CBS begrip
label: CBS concept @en

Begrippen CBS
type: ConceptScheme
preferred label: Concepts Statistics Netherlands @en