Vrije tijd en cultuur
narrower: Archivistiek A (opleiding)
type: Concept

Archivistiek A (opleiding)
type: Concept
type: CBS begrip
in scheme: Begrippen CBS
preferred label: Archive administration Training A @en
definition: Opleiding in de archiefwetenschappen aan de Universiteit van Amsterdam in samenwerking met de Archiefschool Amsterdam.
definition: Training in archivistics at the University of Amsterdam in cooperation with the Institute for archival training and research in Amsterdam. @en
version info: 1
broader: Vrije tijd en cultuur
scope note: Opvolger van de voormalige opleiding tot Hoger Archiefambtenaar.
source: archivistiek-a--opleiding--
modified: 2022-02-23T15:52:29Z
created: 2016-03-23T09:11:36Z

CBS begrip
label: CBS concept @en

Begrippen CBS
type: ConceptScheme
preferred label: Concepts Statistics Netherlands @en