Verkeer en vervoer
narrower: Vrachtauto
type: Concept

Vrachtauto
type: Concept
type: CBS begrip
in scheme: Begrippen CBS
preferred label: Van @en
definition: Een niet-geleed zwaar wegvoertuig waarvan het leeg gewicht vermeerderd met het laadvermogen (toegestane maximum massa) meer dan 3500 kg bedraagt, uitsluitend of voornamelijk ontworpen voor het vervoer van goederen.
definition: Rigid road motor vehicle designed exclusively or primarily to carry goods with a gross vehicle weight of more than 3 500 kg. @en
version info: 1
broader: Verkeer en vervoer
source: vrachtauto
modified: 2022-02-23T15:56:17Z
created: 2016-03-23T09:12:23Z

CBS begrip
label: CBS concept @en

Begrippen CBS
type: ConceptScheme
preferred label: Concepts Statistics Netherlands @en