Natuur en milieu
narrower: Nettomilieulasten
type: Concept

Nettomilieulasten
type: Concept
type: CBS begrip
in scheme: Begrippen CBS
preferred label: Net environmental costs @en
definition: De som van de jaarlijkse netto kosten van eigen milieumaatregelen, vermeerderd met betaalde heffingen, subsidies en betalingen voor milieudiensten, verminderd met de ontvangen heffingen, subsidies en ontvangsten voor milieudiensten.
definition: The sum of the net annual costs of environmental measures taken by the enterprise, plus levies, subsidies and payments for environmental services, minus levies, subsidies and payments received for environmental services. @en
version info: 1
broader: Natuur en milieu
scope note: Milieulasten geven aan in welke mate een sector bijdraagt in de financiering van het milieubeheer.
source: nettomilieulasten
modified: 2022-02-23T15:54:31Z
created: 2016-03-23T09:10:09Z

CBS begrip
label: CBS concept @en

Begrippen CBS
type: ConceptScheme
preferred label: Concepts Statistics Netherlands @en