Bevolking
narrower: Vruchtbaarheid
type: Concept

Vruchtbaarheid
type: Concept
type: CBS begrip
in scheme: Begrippen CBS
preferred label: Fertility @en
definition: In de demografie gebruikt begrip om de geboorte van kinderen door individuen, (echt)paren, bepaalde groepen of de gehele bevolking aan te duiden.
definition: Term used in demography to indicate the actual reproduction by individuals, couples or the population in general. @en
version info: 1
broader: Bevolking
source: vruchtbaarheid
modified: 2022-02-23T15:56:18Z
created: 2016-03-23T09:08:30Z

CBS begrip
label: CBS concept @en

Begrippen CBS
type: ConceptScheme
preferred label: Concepts Statistics Netherlands @en