Verkeer en vervoer
narrower: Studentenweekkaart
type: Concept

Studentenweekkaart
type: Concept
type: CBS begrip
in scheme: Begrippen CBS
preferred label: Student public transport pass @en
definition: OV-studentenkaart die alleen geldig is op maandag tot en met vrijdag.
definition: Public transport pass for students valid from Mondays through Fridays. @en
version info: 1
broader: Verkeer en vervoer
source: studentenweekkaart
modified: 2022-02-23T15:55:39Z
created: 2016-03-23T09:10:12Z

CBS begrip
label: CBS concept @en

Begrippen CBS
type: ConceptScheme
preferred label: Concepts Statistics Netherlands @en