Onderwijs
narrower: Praktijkonderwijs
type: Concept

Speciaal voortgezet onderwijs
related: Praktijkonderwijs
type: Concept
type: CBS begrip
preferred label: Special secondary education @en

Voortgezet onderwijs
related: Praktijkonderwijs
type: Concept
type: CBS begrip
preferred label: Secondary education (VO) @en

Praktijkonderwijs
type: Concept
type: CBS begrip
in scheme: Begrippen CBS
preferred label: Practical training @en
definition: Praktisch onderwijs, aansluitend op het basisonderwijs, dat bestemd is voor leerlingen die niet in staat zijn om een diploma te behalen in het vmbo.
definition: A form of special education for children with moderate learning difficulties. Used to be called vso-mlk. @en
version info: 1
broader: Onderwijs
scope note: Het praktijkonderwijs is hoofdzakelijk voortgekomen uit het speciaal voortgezet onderwijs voor moeilijk lerende kinderen (svo-mlk). Tussen 1999 en 2002 is het svo-mlk omgevormd tot het praktijkonderwijs. Het praktijkonderwijs beoogt de leerlingen op te leiden voor zeer eenvoudig werk op de arbeidsmarkt. Stages vormen een essentieel onderdeel van deze onderwijsvorm. Leerlingen die het praktijkonderwijs verlaten, krijgen een getuigschrift.
source: praktijkonderwijs
modified: 2023-07-06T12:16:23
created: 2016-03-23T09:08:39Z
related: Speciaal voortgezet onderwijs
related: Voortgezet onderwijs

CBS begrip
label: CBS concept @en

Begrippen CBS
type: ConceptScheme
preferred label: Concepts Statistics Netherlands @en