Industrie en energie
narrower: Aardgas
type: Concept

Aardgas
type: Concept
type: CBS begrip
in scheme: Begrippen CBS
preferred label: Natural gas @en
definition: Gas van natuurlijke oorsprong dat vooral bestaat uit methaan.
definition: Gaseous fuel of natural origin mainly consisting of methane. @en
version info: 1
broader: Industrie en energie
scope note: Het ontstaat bij hetzelfde proces dat tot de vorming van aardolie leidt. Voor vervoer over lange afstanden per schip wordt aardgas vloeibaar gemaakt.
source: aardgas
modified: 2022-06-14T08:09:05Z
created: 2016-03-23T09:18:36Z
subject: https://taxonomie.cbs.nl/vocab/id/1648

CBS begrip
label: CBS concept @en

Begrippen CBS
type: ConceptScheme
preferred label: Concepts Statistics Netherlands @en