Onderwijsniveaus
type: Concept
preferred label: Education levels @en
top concept of: SOI 2021

Studierichtingen
type: Concept
preferred label: Fields of study @en
top concept of: SOI 2021

SOI 2021
type: ConceptScheme
created: 2021
description: De SOI 2021 is een classificatie van opleidingen naar niveau en richting. De publicatieindeling naar niveau van de SOI 2021 is een hiërarchische indeling in 4 aggregatieniveaus. Op het hoogste niveau worden 3 niveaus onderscheiden, laag, middelbaar en hoog onderwijsniveau. Het 2e aggregatieniveau bevat 5 categorieën en het 3e aggregatieniveau 8 categorieën. Het 4e aggregatieniveau is een uitbreiding ten opzichte van de SOI 2006 en is ontwikkeld om de toepassingsmogelijkheden van de publicatie-indeling verder te verbeteren. Dit is een indeling in 18 categorieën. De ISCED-F 2013 is als basis genomen voor de richtingindeling van de SOI 2021. De ISCED-F 2013 is ontworpen als een 3-traps hiërarchische richtingindeling in broad, narrow en detailed fields. Voor de Nederlandse toepassing van deze classificatie worden daarvoor de termen hoofdgroepen, subgroepen en detailgroepen gehanteerd. De SOI 2021 voorziet (net als zijn voorganger de SOI 2016) in een voor nationale toepassingen ontwikkeld extra aggregatieniveau: de rubrieken.
description: The SOI 2021 is a classification of education according to educational levels and fields of study. The classification of fields of study follows ISCED F-2013. The levels of education (Levels for publications) have been related to ISCED 2011 levels. The fourth Dutch aggregation level is related to the first ISCED-Level. All the education courses are classified according to ISCED-2011 levels and ISCED-2013 fields of study. See the separe Register of education courses: https://vocabs.cbs.nl/opleidingen/nl/ @en
is referenced by: scheme
is version of: https://vocabs.cbs.nl/def/soi/2021
issued: 2022
modified: 2022-05-09
publisher: Centraal Bureau voor de Statistiek
publisher: Statistics Netherlands @en
source: pubsoi2021 ed2122.pdf
source: soi2021ed2122inclusiefisced.xlsx
version info: 2021/2022
has top concept: Onderwijsniveaus
has top concept: Studierichtingen
preferred label: Standaard Onderwijsindeling 2021
preferred label: Education levels and fields of study Netherlands 2021 @en