internationale handel in goederen
narrower: kritieke materialen
type: Concept
type: Keyword
preferred label: international trade in goods @en

kritieke materialen
type: Concept
in scheme: CBS taxonomie
preferred label: critical materials @en
alternative label: strategische goederen
alternative label: strategische grondstoffen
alternative label: strategiche materialen
alternative label: kritieke grondstoffen
alternative label: critical raw materials
definition: Grondstoffen waarvoor er geen vervanging is met huidige technologieën, waarbij de meeste consumerende landen afhankelijk zijn van import, en waarvan het aanbod wordt gedomineerd door één of enkele producenten. De EU heeft een lijst opgesteld van grondstoffen die het beschouwt als ‘kritieke materialen’. Deze lijst wordt regelmatig bijgewerkt.
broader: internationale handel in goederen
scope note: Vaak worden dit ‘kritieke grondstoffen’ genoemd (in het Engels ‘critical raw materials’), maar omdat het hier niet enkel om grondstoffen gaat maar ook halffabricaten wordt hier de term ‘kritieke materialen’ gebruikt. Met de term ‘kritieke materialen’ worden bij het CBS ook ‘kritieke of strategische materialen’ bedoeld, dus ook koper en nikkel die formeel gelden als strategische, maar niet-kritieke materialen.
modified: 2023-11-13T16:30:59
created: 2023-11-13T13:00:28

CBS taxonomie
type: Ontology
type: ConceptScheme
preferred label: Statistics Netherlands taxonomy @en