productie
narrower: internationale productieketen
type: Concept
type: Keyword
preferred label: manufacturing output @en

internationale productieketen
type: Concept
in scheme: CBS taxonomie
preferred label: value chain @en
alternative label: waardeketen
definition: Een internationale productieketen omvat alle activiteiten – in meer dan één land – die nodig zijn om een product of dienst vanuit de conceptfase via de verschillende productiefases bij eindverbruikers te bezorgen.
broader: productie
modified: 2023-11-24T11:53:34
created: 2023-11-13T14:01:52

CBS taxonomie
type: Ontology
type: ConceptScheme
preferred label: Statistics Netherlands taxonomy @en